da_wrfvar.exe was not generated:Error in opening the compile

Setting up the 3DVAR package within WRF.

da_wrfvar.exe was not generated:Error in opening the compile

Postby Minghua Zheng » Thu Feb 09, 2017 8:31 pm

Hi Everyone,

Thank you for your time for reading my post. I am trying to install WRFDA using WRF3.5.1 version.
My machine configure choice is:
Linux x86_64 i486 i586 i686, Xeon (SNB with AVX mods) ifort compiler with icc (serial)

I have generated 43 exe files but not da_wrfvar.exe. The error message lines are below:

----------------------------------------ERROR Lines-------------------------------
make[1]: [da_obs_io.o] Error 1 (ignored)
da_setup_structures.f(65): error #7002: Error in opening the compiled module file. Check INCLUDE paths. [DA_OBS_IO]
make[1]: [da_setup_structures.o] Error 1 (ignored)
da_transfer_model.f(41): error #7002: Error in opening the compiled module file. Check INCLUDE paths. [DA_SETUP_STRUCTURES]
make[1]: [da_transfer_model.o] Error 1 (ignored)
da_minimisation.f(63): error #7002: Error in opening the compiled module file. Check INCLUDE paths. [DA_OBS_IO]
da_minimisation.f(141): error #7002: Error in opening the compiled module file. Check INCLUDE paths. [DA_TRANSFER_MODEL]
make[1]: [da_minimisation.o] Error 1 (ignored)
da_test.f(43): error #7002: Error in opening the compiled module file. Check INCLUDE paths. [DA_MINIMISATION]
da_test.f(59): error #7002: Error in opening the compiled module file. Check INCLUDE paths. [DA_TRANSFER_MODEL]
make[1]: [da_test.o] Error 1 (ignored)
da_wrfvar_top.f(41): error #7002: Error in opening the compiled module file. Check INCLUDE paths. [DA_MINIMISATION]
da_wrfvar_top.f(46): error #7002: Error in opening the compiled module file. Check INCLUDE paths. [DA_OBS_IO]
da_wrfvar_top.f(51): error #7002: Error in opening the compiled module file. Check INCLUDE paths. [DA_SETUP_STRUCTURES]
da_wrfvar_top.f(54): error #7002: Error in opening the compiled module file. Check INCLUDE paths. [DA_TEST]
da_wrfvar_top.f(57): error #7002: Error in opening the compiled module file. Check INCLUDE paths. [DA_TRANSFER_MODEL]
make[1]: [da_wrfvar_top.o] Error 1 (ignored)
make[1]: [libwrfvar.a] Error 1 (ignored)
make[1]: [libwrfvar.a] Error 1 (ignored)
da_wrfvar_main.f(18): error #7002: Error in opening the compiled module file. Check INCLUDE paths. [DA_WRFVAR_TOP]
make[1]: [da_wrfvar_main.o] Error 1 (ignored)
make[1]: [da_wrfvar.exe] Error 1 (ignored)

---------------------------------------------------------------------------------------------------------

So basically I got one similar error #7002.
Does anyone know how to fix it? Just let me know if more information needed.
Minghua Zheng
 
Posts: 2
Joined: Thu Feb 09, 2017 7:25 pm

Re: da_wrfvar.exe was not generated:Error in opening the com

Postby Minghua Zheng » Mon Feb 13, 2017 6:08 pm

Update:

I chose the wrong machine during configuration. If you meet similar problem, just double check your machine version.
But it is still very strange to me as I successfully compiled WRF using the "wrong" machine version. LOL
Minghua Zheng
 
Posts: 2
Joined: Thu Feb 09, 2017 7:25 pm


Return to Installation

Who is online

Users browsing this forum: No registered users and 2 guests